{"text_format":"1","workbook":"xlsx","n_sheets":8,"sheets":["Basic Analysis","Basic Graphs","AlphaSpec","Gross αβ","Gross αβ Graph","Gamma","Gamma Graphs","Lookup Tables"],"not_rendered":{"charts":5,"images":0,"macros":1,"external_links":0,"defined_names":199,"comments":0,"pivot_tables":0},"unopened":[],"bounds":{"document_bytes":16777216,"sheet_cells":100000,"rows_first":2000,"rows_last":500,"rows_between":2000,"halvings":0,"cell_chars":16384,"cell_head_chars":4096},"cells_cut":0,"cells_raw":0,"read":"whole","date_system":"1900"}

{"sheet":"Basic Analysis","index":0,"n_rows":31,"n_cols":10,"rows_kept":31,"cut":false,"hidden":false,"merged":[[0,1,0,5],[28,0,28,7],[8,1,8,2],[9,1,9,2],[10,1,10,2],[3,1,3,2],[4,1,4,2],[5,1,5,2],[6,1,6,2],[7,1,7,2],[24,0,24,8],[25,0,25,8],[26,0,26,8],[23,0,23,8]]}
[null,"Basic Analysis"]
[]
[]
[null,"Activity unit =",null,"pCi",null,null,null,"Sample count time, tS =",100.0951093328682,"min"]
[null,"Analytical action level, AAL =",null,5,null,null,null,null,{"$f":"IF(RAND()>=0,\"\",\"Force a calculation after every edit\")","v":""}]
[null,"Required relative method uncertainty, ϕMR =",null,0.1,null,null,null,"ϕM =",{"$f":" IFERROR(SQRT((R.S / t.S + R.B / t.B) / R.N^2 + urel_D^2 + urel_DF^2), \"\")","v":0.1},{"$f":"IF(RAND()>0,\"\",\"\")","v":""}]
[null,"Required detection limit, MDCR =",null,1,null,null,null,"MDC =",{"$f":"IFERROR(getGSmdc(t.S, R.B, 1/t.S+1/t.B, (F.A*D*DF)), \"\")","v":1.0455523373262736}]
[null,"Background, RB =",null,1,"cpm"]
[null,"Bkgd count time, tB =",null,3000,"min",null,null,"Half-life, T1/2 =",{"$f":"VLOOKUP(Nuclide, Nuclide_Table[], 2, FALSE)","v":6.15},{"$f":"VLOOKUP(Nuclide,Nuclide_Table[],4,FALSE)","v":"h"}]
[null,"Sample decay time, tD =",null,5,"h",null,null,"urel(T1/2) =",{"$f":" IFERROR(VLOOKUP(Nuclide, Nuclide_Table[], 3, FALSE) / T.12, \"\")","v":4.878048780487804E-3}]
{"$rows_left_out":22}
{"sheet":"Basic Graphs","index":1,"n_rows":65,"n_cols":11,"rows_kept":65,"cut":false,"hidden":false,"merged":[[64,10,64,22]]}
["Paired =",false]
["tS","tB","DDC","DF","RN","RS","ϕM","ϕMR","MDC","MDCR"]
[1,{"$f":"IF(Paired, Main_Graphs_Table[[#This Row],[tS]], 'Basic Analysis'!t.B)","v":3000},{"$f":"DDCf( ('Basic Analysis'!λ) * Main_Graphs_Table[[#This Row],[tS]])","v":0.99906136399628909},{"$f":" ('Basic Analysis'!DBC) * Main_Graphs_Table[[#This Row],[DDC]]","v":0.56865954112583428},{"$f":" ('Basic Analysis'!AAL) * ('Basic Analysis'!D) * Main_Graphs_Table[[#This Row],[DF]] * ('Basic Analysis'!F.A)","v":1.8936362719490283},{"$f":" Main_Graphs_Table[[#This Row],[RN]] + ('Basic Analysis'!R.B)","v":2.8936362719490285},{"$f":" SQRT( (Main_Graphs_Table[[#This Row],[RS]]/Main_Graphs_Table[[#This Row],[tS]] + ('Basic Analysis'!R.B)/Main_Graphs_Table[[#This Row],[tB]]) / Main_Graphs_Table[[#This Row],[RN]]^2 + ('Basic Analysis'!urel_D)^2 +urelDF('Basic Analysis'!λ, 'Basic Analysis'!urel_T.12, ('Basic Analysis'!t.D)*('Basic Analysis'!F.t.D), Main_Graphs_Table[[#This Row],[tS]])^ 2)","v":0.89878157416455418},{"$f":" 'Basic Analysis'!φ.MR","v":0.1},{"$f":" ((1.645^2)/Main_Graphs_Table[[#This Row],[tS]] + 2*1.645*SQRT('Basic Analysis'!R.B/Main_Graphs_Table[[#This Row],[tS]] + 'Basic Analysis'!R.B/Main_Graphs_Table[[#This Row],[tB]])) / (('Basic Analysis'!D) * Main_Graphs_Table[[#This Row],[DF]] * ('Basic Analysis'!F.A))","v":15.833487603916986},{"$f":" 'Basic Analysis'!MDC.R","v":1}]
[1.5,{"$f":"IF(Paired, Main_Graphs_Table[[#This Row],[tS]], 'Basic Analysis'!t.B)","v":3000},{"$f":"DDCf( ('Basic Analysis'!λ) * Main_Graphs_Table[[#This Row],[tS]])","v":0.99859248654766675},{"$f":" ('Basic Analysis'!DBC) * Main_Graphs_Table[[#This Row],[DDC]]","v":0.56839265898587121},{"$f":" ('Basic Analysis'!AAL) * ('Basic Analysis'!D) * Main_Graphs_Table[[#This Row],[DF]] * ('Basic Analysis'!F.A)","v":1.8927475544229513},{"$f":" Main_Graphs_Table[[#This Row],[RN]] + ('Basic Analysis'!R.B)","v":2.8927475544229511},{"$f":" SQRT( (Main_Graphs_Table[[#This Row],[RS]]/Main_Graphs_Table[[#This Row],[tS]] + ('Basic Analysis'!R.B)/Main_Graphs_Table[[#This Row],[tB]]) / Main_Graphs_Table[[#This Row],[RN]]^2 + ('Basic Analysis'!urel_D)^2 +urelDF('Basic Analysis'!λ, 'Basic Analysis'!urel_T.12, ('Basic Analysis'!t.D)*('Basic Analysis'!F.t.D), Main_Graphs_Table[[#This Row],[tS]])^ 2)","v":0.73427680455233479},{"$f":" 'Basic Analysis'!φ.MR","v":0.1},{"$f":" ((1.645^2)/Main_Graphs_Table[[#This Row],[tS]] + 2*1.645*SQRT('Basic Analysis'!R.B/Main_Graphs_Table[[#This Row],[tS]] + 'Basic Analysis'!R.B/Main_Graphs_Table[[#This Row],[tB]])) / (('Basic Analysis'!D) * Main_Graphs_Table[[#This Row],[DF]] * ('Basic Analysis'!F.A))","v":11.863605085467404},{"$f":" 'Basic Analysis'!MDC.R","v":1}]
[2,{"$f":"IF(Paired, Main_Graphs_Table[[#This Row],[tS]], 'Basic Analysis'!t.B)","v":3000},{"$f":"DDCf( ('Basic Analysis'!λ) * Main_Graphs_Table[[#This Row],[tS]])","v":0.99812390252549033},{"$f":" ('Basic Analysis'!DBC) * Main_Graphs_Table[[#This Row],[DDC]]","v":0.56812594386242388},{"$f":" ('Basic Analysis'!AAL) * ('Basic Analysis'!D) * Main_Graphs_Table[[#This Row],[DF]] * ('Basic Analysis'!F.A)","v":1.8918593930618717},{"$f":" Main_Graphs_Table[[#This Row],[RN]] + ('Basic Analysis'!R.B)","v":2.8918593930618717},{"$f":" SQRT( (Main_Graphs_Table[[#This Row],[RS]]/Main_Graphs_Table[[#This Row],[tS]] + ('Basic Analysis'!R.B)/Main_Graphs_Table[[#This Row],[tB]]) / Main_Graphs_Table[[#This Row],[RN]]^2 + ('Basic Analysis'!urel_D)^2 +urelDF('Basic Analysis'!λ, 'Basic Analysis'!urel_T.12, ('Basic Analysis'!t.D)*('Basic Analysis'!F.t.D), Main_Graphs_Table[[#This Row],[tS]])^ 2)","v":0.63627012410711059},{"$f":" 'Basic Analysis'!φ.MR","v":0.1},{"$f":" ((1.645^2)/Main_Graphs_Table[[#This Row],[tS]] + 2*1.645*SQRT('Basic Analysis'!R.B/Main_Graphs_Table[[#This Row],[tS]] + 'Basic Analysis'!R.B/Main_Graphs_Table[[#This Row],[tB]])) / (('Basic Analysis'!D) * Main_Graphs_Table[[#This Row],[DF]] * ('Basic Analysis'!F.A))","v":9.7263283805250094},{"$f":" 'Basic Analysis'!MDC.R","v":1}]
[3,{"$f":"IF(Paired, Main_Graphs_Table[[#This Row],[tS]], 'Basic Analysis'!t.B)","v":3000},{"$f":"DDCf( ('Basic Analysis'!λ) * Main_Graphs_Table[[#This Row],[tS]])","v":0.99718761393427746},{"$f":" ('Basic Analysis'!DBC) * Main_Graphs_Table[[#This Row],[DDC]]","v":0.5675930141948099},{"$f":" ('Basic Analysis'!AAL) * ('Basic Analysis'!D) * Main_Graphs_Table[[#This Row],[DF]] * ('Basic Analysis'!F.A)","v":1.8900847372687171},{"$f":" Main_Graphs_Table[[#This Row],[RN]] + ('Basic Analysis'!R.B)","v":2.8900847372687171},{"$f":" SQRT( (Main_Graphs_Table[[#This Row],[RS]]/Main_Graphs_Table[[#This Row],[tS]] + ('Basic Analysis'!R.B)/Main_Graphs_Table[[#This Row],[tB]]) / Main_Graphs_Table[[#This Row],[RN]]^2 + ('Basic Analysis'!urel_D)^2 +urelDF('Basic Analysis'!λ, 'Basic Analysis'!urel_T.12, ('Basic Analysis'!t.D)*('Basic Analysis'!F.t.D), Main_Graphs_Table[[#This Row],[tS]])^ 2)","v":0.52011277514791565},{"$f":" 'Basic Analysis'!φ.MR","v":0.1},{"$f":" ((1.645^2)/Main_Graphs_Table[[#This Row],[tS]] + 2*1.645*SQRT('Basic Analysis'!R.B/Main_Graphs_Table[[#This Row],[tS]] + 'Basic Analysis'!R.B/Main_Graphs_Table[[#This Row],[tB]])) / (('Basic Analysis'!D) * Main_Graphs_Table[[#This Row],[DF]] * ('Basic Analysis'!F.A))","v":7.4135306412056794},{"$f":" 'Basic Analysis'!MDC.R","v":1}]
[4,{"$f":"IF(Paired, Main_Graphs_Table[[#This Row],[tS]], 'Basic Analysis'!t.B)","v":3000},{"$f":"DDCf( ('Basic Analysis'!λ) * Main_Graphs_Table[[#This Row],[tS]])","v":0.99625249657180681},{"$f":" ('Basic Analysis'!DBC) * Main_Graphs_Table[[#This Row],[DDC]]","v":0.56706075118334254},{"$f":" ('Basic Analysis'!AAL) * ('Basic Analysis'!D) * Main_Graphs_Table[[#This Row],[DF]] * ('Basic Analysis'!F.A)","v":1.8883123014405307},{"$f":" Main_Graphs_Table[[#This Row],[RN]] + ('Basic Analysis'!R.B)","v":2.8883123014405307},{"$f":" SQRT( (Main_Graphs_Table[[#This Row],[RS]]/Main_Graphs_Table[[#This Row],[tS]] + ('Basic Analysis'!R.B)/Main_Graphs_Table[[#This Row],[tB]]) / Main_Graphs_Table[[#This Row],[RN]]^2 + ('Basic Analysis'!urel_D)^2 +urelDF('Basic Analysis'!λ, 'Basic Analysis'!urel_T.12, ('Basic Analysis'!t.D)*('Basic Analysis'!F.t.D), Main_Graphs_Table[[#This Row],[tS]])^ 2)","v":0.45095065826009134},{"$f":" 'Basic Analysis'!φ.MR","v":0.1},{"$f":" ((1.645^2)/Main_Graphs_Table[[#This Row],[tS]] + 2*1.645*SQRT('Basic Analysis'!R.B/Main_Graphs_Table[[#This Row],[tS]] + 'Basic Analysis'!R.B/Main_Graphs_Table[[#This Row],[tB]])) / (('Basic Analysis'!D) * Main_Graphs_Table[[#This Row],[DF]] * ('Basic Analysis'!F.A))","v":6.1499428605712509},{"$f":" 'Basic Analysis'!MDC.R","v":1}]
[5,{"$f":"IF(Paired, Main_Graphs_Table[[#This Row],[tS]], 'Basic Analysis'!t.B)","v":3000},{"$f":"DDCf( ('Basic Analysis'!λ) * Main_Graphs_Table[[#This Row],[tS]])","v":0.99531854878971349},{"$f":" ('Basic Analysis'!DBC) * Main_Graphs_Table[[#This Row],[DDC]]","v":0.56652915388978264},{"$f":" ('Basic Analysis'!AAL) * ('Basic Analysis'!D) * Main_Graphs_Table[[#This Row],[DF]] * ('Basic Analysis'!F.A)","v":1.8865420824529764},{"$f":" Main_Graphs_Table[[#This Row],[RN]] + ('Basic Analysis'!R.B)","v":2.8865420824529764},{"$f":" SQRT( (Main_Graphs_Table[[#This Row],[RS]]/Main_Graphs_Table[[#This Row],[tS]] + ('Basic Analysis'!R.B)/Main_Graphs_Table[[#This Row],[tB]]) / Main_Graphs_Table[[#This Row],[RN]]^2 + ('Basic Analysis'!urel_D)^2 +urelDF('Basic Analysis'!λ, 'Basic Analysis'!urel_T.12, ('Basic Analysis'!t.D)*('Basic Analysis'!F.t.D), Main_Graphs_Table[[#This Row],[tS]])^ 2)","v":0.40380728271285909},{"$f":" 'Basic Analysis'!φ.MR","v":0.1},{"$f":" ((1.645^2)/Main_Graphs_Table[[#This Row],[tS]] + 2*1.645*SQRT('Basic Analysis'!R.B/Main_Graphs_Table[[#This Row],[tS]] + 'Basic Analysis'!R.B/Main_Graphs_Table[[#This Row],[tB]])) / (('Basic Analysis'!D) * Main_Graphs_Table[[#This Row],[DF]] * ('Basic Analysis'!F.A))","v":5.3371810469501906},{"$f":" 'Basic Analysis'!MDC.R","v":1}]
[6,{"$f":"IF(Paired, Main_Graphs_Table[[#This Row],[tS]], 'Basic Analysis'!t.B)","v":3000},{"$f":"DDCf( ('Basic Analysis'!λ) * Main_Graphs_Table[[#This Row],[tS]])","v":0.9943857689421064},{"$f":" ('Basic Analysis'!DBC) * Main_Graphs_Table[[#This Row],[DDC]]","v":0.56599822137729916},{"$f":" ('Basic Analysis'!AAL) * ('Basic Analysis'!D) * Main_Graphs_Table[[#This Row],[DF]] * ('Basic Analysis'!F.A)","v":1.8847740771864063},{"$f":" Main_Graphs_Table[[#This Row],[RN]] + ('Basic Analysis'!R.B)","v":2.8847740771864063},{"$f":" SQRT( (Main_Graphs_Table[[#This Row],[RS]]/Main_Graphs_Table[[#This Row],[tS]] + ('Basic Analysis'!R.B)/Main_Graphs_Table[[#This Row],[tB]]) / Main_Graphs_Table[[#This Row],[RN]]^2 + ('Basic Analysis'!urel_D)^2 +urelDF('Basic Analysis'!λ, 'Basic Analysis'!urel_T.12, ('Basic Analysis'!t.D)*('Basic Analysis'!F.t.D), Main_Graphs_Table[[#This Row],[tS]])^ 2)","v":0.36904804741323005},{"$f":" 'Basic Analysis'!φ.MR","v":0.1},{"$f":" ((1.645^2)/Main_Graphs_Table[[#This Row],[tS]] + 2*1.645*SQRT('Basic Analysis'!R.B/Main_Graphs_Table[[#This Row],[tS]] + 'Basic Analysis'!R.B/Main_Graphs_Table[[#This Row],[tB]])) / (('Basic Analysis'!D) * Main_Graphs_Table[[#This Row],[DF]] * ('Basic Analysis'!F.A))","v":4.7631265996373289},{"$f":" 'Basic Analysis'!MDC.R","v":1}]
[7,{"$f":"IF(Paired, Main_Graphs_Table[[#This Row],[tS]], 'Basic Analysis'!t.B)","v":3000},{"$f":"DDCf( ('Basic Analysis'!λ) * Main_Graphs_Table[[#This Row],[tS]])","v":0.99345415538556658},{"$f":" ('Basic Analysis'!DBC) * Main_Graphs_Table[[#This Row],[DDC]]","v":0.56546795271046835},{"$f":" ('Basic Analysis'!AAL) * ('Basic Analysis'!D) * Main_Graphs_Table[[#This Row],[DF]] * ('Basic Analysis'!F.A)","v":1.8830082825258598},{"$f":" Main_Graphs_Table[[#This Row],[RN]] + ('Basic Analysis'!R.B)","v":2.8830082825258598},{"$f":" SQRT( (Main_Graphs_Table[[#This Row],[RS]]/Main_Graphs_Table[[#This Row],[tS]] + ('Basic Analysis'!R.B)/Main_Graphs_Table[[#This Row],[tB]]) / Main_Graphs_Table[[#This Row],[RN]]^2 + ('Basic Analysis'!urel_D)^2 +urelDF('Basic Analysis'!λ, 'Basic Analysis'!urel_T.12, ('Basic Analysis'!t.D)*('Basic Analysis'!F.t.D), Main_Graphs_Table[[#This Row],[tS]])^ 2)","v":0.34206462764018603},{"$f":" 'Basic Analysis'!φ.MR","v":0.1},{"$f":" ((1.645^2)/Main_Graphs_Table[[#This Row],[tS]] + 2*1.645*SQRT('Basic Analysis'!R.B/Main_Graphs_Table[[#This Row],[tS]] + 'Basic Analysis'!R.B/Main_Graphs_Table[[#This Row],[tB]])) / (('Basic Analysis'!D) * Main_Graphs_Table[[#This Row],[DF]] * ('Basic Analysis'!F.A))","v":4.3322380461341528},{"$f":" 'Basic Analysis'!MDC.R","v":1}]
{"$rows_left_out":56}
{"sheet":"AlphaSpec","index":2,"n_rows":35,"n_cols":9,"rows_kept":35,"cut":false,"hidden":false,"merged":[[33,3,33,4],[34,3,34,4],[0,1,0,4],[29,3,29,4],[30,3,30,4],[31,3,31,4],[32,3,32,4]]}
[null,"Alpha-Particle Spectrometry with Tracer"]
[]
[]
[null,"Result unit =","pCi","by",{"$f":" VLOOKUP(Unit_Result, ConcUnit_Table[],4,FALSE)","v":"Total"},null,"Sample count time, tS =",99.962206531279364,"min"]
[null,"Analytical action level, AAL =",1.2]
[null,"Required relative method uncertainty, ϕMR =",0.2,null,null,null,"ϕM =",{"$f":"IFERROR(SQRT( (R.SA/t.S+R.BA/t.B) / R.NA^2 + (R.ST/t.S+R.BT/t.B) / R.NT^2 + urel_V.A^2 + urel_I.A^2 + urel_DF.A^2 + urel_c.T^2 + urel_V.T^2 + urel_I.T^2 + urel_DF.T^2), \"\")","v":0.2},{"$f":"IF(RAND()>0,\"\",\"\")","v":""}]
[null,"Required detection limit, MDCR =",1,null,null,null,"MDC =",{"$f":"IFERROR(getGSmdc(t.S, R.BA, 1/t.S+1/t.B, (F.Res*ε*Y*V.A*F.V.A*I.A*DF.A)), \"\")","v":0.18639077397448761},{"$f":"Unit_Result","v":"pCi"}]
[null,"Sample aliquot, VA =",1,null,{"$f":" IF( IF(Unit_V.A=\"\", Type1, VLOOKUP(Unit_V.A, Aliquot_Unit_Table[], 2, FALSE)) = Type_Res, Type_Res, \"Mismatch\")","v":"Total"}]
[null,"urel(VA) =",1E-3,null,null,null,"Half-life, T1/2(Analyte) =",{"$f":"VLOOKUP(Analyte, Nuclide_Table[], 2, FALSE)","v":138.37629999999999},{"$f":"VLOOKUP(Analyte,Nuclide_Table[],4,FALSE)","v":"d"}]
[null,"Analyte alpha intensity, IA =",1,null,null,null,"urel(T1/2) =",{"$f":"VLOOKUP(Analyte, Nuclide_Table[], 3, FALSE) / T.12A","v":1.2285340770059613E-5}]
{"$rows_left_out":26}
{"sheet":"Gross αβ","index":3,"n_rows":17,"n_cols":11,"rows_kept":17,"cut":false,"hidden":false,"merged":[[13,5,16,5],[6,9,6,10],[7,9,7,10]]}
[null,"Gross α+β Analysis"]
[]
[]
[null,"Result unit =","pCi/L","by",{"$f":" VLOOKUP(Unit_Result,ConcUnit_Table[],4,FALSE)","v":"Volume"},null,null,"Sample count time, tS =",{"$f":" IF(OR(D<=0,Type_Res<>Type_V), \"None\", _xlfn.SWITCH(Option,1,t.Sα,2,t.Sβ,3,IF(OR(t.Sα=\"None\",t.Sβ=\"None\"),\"None\",MAX(t.Sα,t.Sβ)),t.S_std))","v":100},"min"]
[null,"α activity concentration, ACα =",20,null,null,null,null,"Alpha-to-beta cross-efficiency, εα→β =",{"$f":" ε.αα*X.αβ","v":1.0000000000000002E-2},"ⓘ"]
[null,"ϕMRα =",0.15,"ⓘ",null,null,null,"Beta-to-alpha cross-efficiency, εβ→α =",{"$f":" ε.ββ*X.βα","v":3.4999999999999996E-3},"ⓘ"]
[null,"β activity concentration, ACβ =",100,null,null,null,null,"Result unit factor, FRes =",{"$f":" IF(Type_Res<>Type_V, \"\", VLOOKUP(Unit_Result,ConcUnit_Table[],5,FALSE)*60)","v":2220},{"$f":"IF(F.Res=1,\"\",\"(dpm/\"&VLOOKUP(Unit_Result,ConcUnit_Table[],6,FALSE)&\") / (\"&Unit_Result&\")\")","v":"(dpm/m3) / (pCi/L)"}]
[null,"ϕMRβ =",0.1,"ⓘ",null,4,null,"Aliquot size factor, FV =",{"$f":" IF(Type_Res<>Type_V, \"\", IF(Type_V=Type1, 1, VLOOKUP(Unit_V, Aliquot_Unit_Table[], 3, FALSE)))","v":1E-3},{"$f":" IFERROR(IF(F.V=1,\"\",VLOOKUP(Type_V,SI_Unit_Table[],2,FALSE) &\"/\"& Unit_V), \"Error\")","v":"m3/L"}]
[null,"Aliquot size, V =",1,"L",{"$f":" IF(IF(Unit_V=\"\", Type1, VLOOKUP(Unit_V,Aliquot_Unit_Table[],2,FALSE)) = Type_Res, Type_Res, \"Mismatch\")","v":"Volume"},null,null,"Alpha net count rate, RNα =",{"$f":" IF(Type_Res=Type_V, IFERROR((AC.α*ε.αα + AC.β*ε.βα) * V * F.V * F.Res, \"\"), \"\")","v":5.2170000000000005},"cpm",{"$f":" IFERROR(IF(AND(Type_Res=Type_V, R.Nα > 100000), \"High\", \"\"), \"\")","v":""}]
[null,"Alpha efficiency, εα =",0.1,"ⓘ",null,null,null,"Beta net count rate, RNβ =",{"$f":" IF(Type_Res=Type_V, IFERROR((AC.β*ε.ββ + AC.α*ε.αβ) * V * F.V * F.Res, \"\"), \"\")","v":78.144000000000005},"cpm",{"$f":" IFERROR(IF(AND(Type_Res=Type_V, R.Nβ > 100000), \"High\", \"\"), \"\")","v":""}]
{"$rows_left_out":8}
{"sheet":"Gross αβ Graph","index":4,"n_rows":53,"n_cols":15,"rows_kept":53,"cut":false,"hidden":false,"merged":[[52,1,52,13]]}
[]
["ACα =",{"$f":" 'Gross αβ'!AC.α","v":20},{"$f":"'Gross αβ'!Unit_Result","v":"pCi/L"},"ACβ =",{"$f":" 'Gross αβ'!AC.β","v":100},{"$f":"'Gross αβ'!Unit_Result","v":"pCi/L"},"tS","u2(RNα)","u2(RNβ)","ϕMα","ϕMβ","ϕMRα","ϕMRβ","αMin","βMin"]
["V =",{"$f":" 'Gross αβ'!V","v":1},{"$f":"'Gross αβ'!Unit_V","v":"L"},null,null,null,1,{"$f":" R.Sα/Table_Gross_αβ_Graphs[[#This Row],[tS]] + R.Bα/t.B","v":5.3170999999999999},{"$f":" R.Sβ/Table_Gross_αβ_Graphs[[#This Row],[tS]] + R.Bβ/t.B","v":79.14500000000001},{"$f":" IFERROR(SQRT(F.ββ^2*Table_Gross_αβ_Graphs[[#This Row],[u2(RNα)]] + F.βα^2*Table_Gross_αβ_Graphs[[#This Row],[u2(RNβ)]]) / (V*F.V*AC.α*F.Res), \"None\")","v":0.52024982045971735},{"$f":" IFERROR(SQRT(F.αα^2*Table_Gross_αβ_Graphs[[#This Row],[u2(RNβ)]] + F.αβ^2*Table_Gross_αβ_Graphs[[#This Row],[u2(RNα)]]) / (V*F.V* AC.β*F.Res), \"None\")","v":0.11464921066015592},{"$f":"'Gross αβ'!φMRα","v":0.15},{"$f":"'Gross αβ'!φMRβ","v":0.1},{"$f":" IFERROR(SQRT(F.ββ^2*(R.Bα/t.B) + F.βα^2*(R.Bβ/t.B)) / (V*F.V*AC.α*F.Res), \"None\")","v":2.2556337307182428E-3},{"$f":" IFERROR(SQRT(F.αα^2*(R.Bβ/t.B) + F.αβ^2*(R.Bα/t.B)) / (V*F.V*AC.β*F.Res), \"None\")","v":4.0759658035271768E-4}]
["FRes =",{"$f":"'Gross αβ'!F.Res","v":2220},null,"FV =",{"$f":"'Gross αβ'!F.V","v":1E-3},null,2,{"$f":" R.Sα/Table_Gross_αβ_Graphs[[#This Row],[tS]] + R.Bα/t.B","v":2.6586000000000003},{"$f":" R.Sβ/Table_Gross_αβ_Graphs[[#This Row],[tS]] + R.Bβ/t.B","v":39.573},{"$f":" IFERROR(SQRT(F.ββ^2*Table_Gross_αβ_Graphs[[#This Row],[u2(RNα)]] + F.βα^2*Table_Gross_αβ_Graphs[[#This Row],[u2(RNβ)]]) / (V*F.V*AC.α*F.Res), \"None\")","v":0.36787563358551989},{"$f":" IFERROR(SQRT(F.αα^2*Table_Gross_αβ_Graphs[[#This Row],[u2(RNβ)]] + F.αβ^2*Table_Gross_αβ_Graphs[[#This Row],[u2(RNα)]]) / (V*F.V* AC.β*F.Res), \"None\")","v":8.1069746638216172E-2},{"$f":"'Gross αβ'!φMRα","v":0.15},{"$f":"'Gross αβ'!φMRβ","v":0.1},2.2556337307182428E-3,4.0759658035271768E-4]
["tB =",{"$f":" 'Gross αβ'!t.B","v":1000},"min",null,null,null,5,{"$f":" R.Sα/Table_Gross_αβ_Graphs[[#This Row],[tS]] + R.Bα/t.B","v":1.0635000000000001},{"$f":" R.Sβ/Table_Gross_αβ_Graphs[[#This Row],[tS]] + R.Bβ/t.B","v":15.829800000000001},{"$f":" IFERROR(SQRT(F.ββ^2*Table_Gross_αβ_Graphs[[#This Row],[u2(RNα)]] + F.βα^2*Table_Gross_αβ_Graphs[[#This Row],[u2(RNβ)]]) / (V*F.V*AC.α*F.Res), \"None\")","v":0.23267153982491148},{"$f":" IFERROR(SQRT(F.αα^2*Table_Gross_αβ_Graphs[[#This Row],[u2(RNβ)]] + F.αβ^2*Table_Gross_αβ_Graphs[[#This Row],[u2(RNα)]]) / (V*F.V* AC.β*F.Res), \"None\")","v":5.1273981793666212E-2},{"$f":"'Gross αβ'!φMRα","v":0.15},{"$f":"'Gross αβ'!φMRβ","v":0.1},2.2556337307182428E-3,4.0759658035271768E-4]
["Fαα =",{"$f":" 'Gross αβ'!F.αα","v":2.8600028600028606},null,"Fαβ =",{"$f":" 'Gross αβ'!F.αβ","v":0.2860002860002861},null,10,{"$f":" R.Sα/Table_Gross_αβ_Graphs[[#This Row],[tS]] + R.Bα/t.B","v":0.53180000000000005},{"$f":" R.Sβ/Table_Gross_αβ_Graphs[[#This Row],[tS]] + R.Bβ/t.B","v":7.9154000000000009},{"$f":" IFERROR(SQRT(F.ββ^2*Table_Gross_αβ_Graphs[[#This Row],[u2(RNα)]] + F.βα^2*Table_Gross_αβ_Graphs[[#This Row],[u2(RNβ)]]) / (V*F.V*AC.α*F.Res), \"None\")","v":0.1645313546531823},{"$f":" IFERROR(SQRT(F.αα^2*Table_Gross_αβ_Graphs[[#This Row],[u2(RNβ)]] + F.αβ^2*Table_Gross_αβ_Graphs[[#This Row],[u2(RNα)]]) / (V*F.V* AC.β*F.Res), \"None\")","v":3.6257325769763621E-2},{"$f":"'Gross αβ'!φMRα","v":0.15},{"$f":"'Gross αβ'!φMRβ","v":0.1},2.2556337307182428E-3,4.0759658035271768E-4]
["Fββ =",{"$f":" 'Gross αβ'!F.ββ","v":10.01001001001001},null,"Fβα =",{"$f":" 'Gross αβ'!F.βα","v":0.10010010010010011},null,20,{"$f":" R.Sα/Table_Gross_αβ_Graphs[[#This Row],[tS]] + R.Bα/t.B","v":0.26595000000000002},{"$f":" R.Sβ/Table_Gross_αβ_Graphs[[#This Row],[tS]] + R.Bβ/t.B","v":3.9582000000000002},{"$f":" IFERROR(SQRT(F.ββ^2*Table_Gross_αβ_Graphs[[#This Row],[u2(RNα)]] + F.βα^2*Table_Gross_αβ_Graphs[[#This Row],[u2(RNβ)]]) / (V*F.V*AC.α*F.Res), \"None\")","v":0.11635216918377245},{"$f":" IFERROR(SQRT(F.αα^2*Table_Gross_αβ_Graphs[[#This Row],[u2(RNβ)]] + F.αβ^2*Table_Gross_αβ_Graphs[[#This Row],[u2(RNα)]]) / (V*F.V* AC.β*F.Res), \"None\")","v":2.5639420888029823E-2},{"$f":"'Gross αβ'!φMRα","v":0.15},{"$f":"'Gross αβ'!φMRβ","v":0.1},2.2556337307182428E-3,4.0759658035271768E-4]
["RBα =",{"$f":" 'Gross αβ'!R.Bα","v":0.1},"cpm","RBβ =",{"$f":"'Gross αβ'!R.Bβ","v":1},"cpm",50,{"$f":" R.Sα/Table_Gross_αβ_Graphs[[#This Row],[tS]] + R.Bα/t.B","v":0.10644000000000001},{"$f":" R.Sβ/Table_Gross_αβ_Graphs[[#This Row],[tS]] + R.Bβ/t.B","v":1.58388},{"$f":" IFERROR(SQRT(F.ββ^2*Table_Gross_αβ_Graphs[[#This Row],[u2(RNα)]] + F.βα^2*Table_Gross_αβ_Graphs[[#This Row],[u2(RNβ)]]) / (V*F.V*AC.α*F.Res), \"None\")","v":7.3608312299793796E-2},{"$f":" IFERROR(SQRT(F.αα^2*Table_Gross_αβ_Graphs[[#This Row],[u2(RNβ)]] + F.αβ^2*Table_Gross_αβ_Graphs[[#This Row],[u2(RNα)]]) / (V*F.V* AC.β*F.Res), \"None\")","v":1.6218866864636541E-2},{"$f":"'Gross αβ'!φMRα","v":0.15},{"$f":"'Gross αβ'!φMRβ","v":0.1},2.2556337307182428E-3,4.0759658035271768E-4]
["RSα =",{"$f":"'Gross αβ'!R.Sα","v":5.3170000000000002},"cpm","RSβ =",{"$f":"'Gross αβ'!R.Sβ","v":79.144000000000005},"cpm",100,{"$f":" R.Sα/Table_Gross_αβ_Graphs[[#This Row],[tS]] + R.Bα/t.B","v":5.3270000000000005E-2},{"$f":" R.Sβ/Table_Gross_αβ_Graphs[[#This Row],[tS]] + R.Bβ/t.B","v":0.79244000000000003},{"$f":" IFERROR(SQRT(F.ββ^2*Table_Gross_αβ_Graphs[[#This Row],[u2(RNα)]] + F.βα^2*Table_Gross_αβ_Graphs[[#This Row],[u2(RNβ)]]) / (V*F.V*AC.α*F.Res), \"None\")","v":5.2073369024632582E-2},{"$f":" IFERROR(SQRT(F.αα^2*Table_Gross_αβ_Graphs[[#This Row],[u2(RNβ)]] + F.αβ^2*Table_Gross_αβ_Graphs[[#This Row],[u2(RNα)]]) / (V*F.V* AC.β*F.Res), \"None\")","v":1.1472091730480548E-2},{"$f":"'Gross αβ'!φMRα","v":0.15},{"$f":"'Gross αβ'!φMRβ","v":0.1},2.2556337307182428E-3,4.0759658035271768E-4]
[null,null,null,null,null,null,200,{"$f":" R.Sα/Table_Gross_αβ_Graphs[[#This Row],[tS]] + R.Bα/t.B","v":2.6685E-2},{"$f":" R.Sβ/Table_Gross_αβ_Graphs[[#This Row],[tS]] + R.Bβ/t.B","v":0.39672000000000002},{"$f":" IFERROR(SQRT(F.ββ^2*Table_Gross_αβ_Graphs[[#This Row],[u2(RNα)]] + F.βα^2*Table_Gross_αβ_Graphs[[#This Row],[u2(RNβ)]]) / (V*F.V*AC.α*F.Res), \"None\")","v":3.6855960475225165E-2},{"$f":" IFERROR(SQRT(F.αα^2*Table_Gross_αβ_Graphs[[#This Row],[u2(RNβ)]] + F.αβ^2*Table_Gross_αβ_Graphs[[#This Row],[u2(RNα)]]) / (V*F.V* AC.β*F.Res), \"None\")","v":8.117112283468654E-3},{"$f":"'Gross αβ'!φMRα","v":0.15},{"$f":"'Gross αβ'!φMRβ","v":0.1},2.2556337307182428E-3,4.0759658035271768E-4]
{"$rows_left_out":44}
{"sheet":"Gamma","index":5,"n_rows":26,"n_cols":9,"rows_kept":26,"cut":false,"hidden":false,"merged":[[0,1,0,4],[20,1,20,4]]}
[null,"Gamma-Ray Spectrometry"]
[]
[]
[null,"Result unit =","pCi/g","by",{"$f":" VLOOKUP(Unit_Result, ConcUnit_Table[],4,FALSE)","v":"Mass"},null,"Sample count time, tS =",34.224546925436663,"min"]
[null,"Analytical action level, AAL =",0.5]
[null,"Required relative method uncertainty, ϕMR =",0.05,null,null,null,"ϕM =",{"$f":"IFERROR(SQRT( (R.N+(1+F)*R.B) / (t.S * R.N^2)  + urel_V^2 + urel_ε^2 + urel_I^2 + urel_DF^2), \"\")","v":5.000000000000001E-2},{"$f":"IF(RAND()>0,\"\",\"\")","v":""}]
[null,"Required detection limit, MDCR =",0.1,null,null,null,"MDC =",{"$f":"IFERROR(getGSmdc(t.S, R.B, (1 + n.P/n.BL) / t.S, (F.Res * ε * (V * F.V) * I * DF)), \"\")","v":3.3451264796512663E-2},{"$f":"Unit_Result","v":"pCi/g"}]
[null,"Sample aliquot, V =",400,"g",{"$f":" IF( IF(Unit_V=\"\", Type1, VLOOKUP(Unit_V, Aliquot_Unit_Table[], 2, FALSE)) = Type_Res, Type_Res, \"Mismatch\")","v":"Mass"}]
[null,"urel(V) =",1E-3,null,null,null,"Half-life, T1/2 =",{"$f":" VLOOKUP(Analyte, Nuclide_Table[], 2, FALSE)","v":8.0233000000000008},{"$f":"VLOOKUP(Analyte,Nuclide_Table[],4,FALSE)","v":"d"}]
[null,"Gamma intensity, Iγ =",0.6," ⓘ",null,null,"urel(T1/2) =",{"$f":" VLOOKUP(Analyte, Nuclide_Table[], 3, FALSE) / T.12","v":2.3681029003028677E-4}]
{"$rows_left_out":17}
{"sheet":"Gamma Graphs","index":6,"n_rows":47,"n_cols":9,"rows_kept":47,"cut":false,"hidden":false,"merged":[]}
[]
["Analyte =",{"$f":"Gamma!Analyte","v":"I-131"}]
["AAL =",{"$f":"Gamma!AAL","v":0.5},{"$f":"Gamma!Unit_Result","v":"pCi/g"}]
["ε =",{"$f":"Gamma!ε","v":0.1}]
["V =",{"$f":"Gamma!V","v":400},{"$f":"Gamma!Unit_V","v":"g"}]
["I =",{"$f":"Gamma!I","v":0.6}]
["DBC =",{"$f":"Gamma!DBC","v":0.64923605484895941}]
["FRes =",{"$f":"Gamma!F.Res","v":2220}]
["FV =",{"$f":"Gamma!F.V","v":1E-3}]
["nP =",{"$f":"Gamma!n.P","v":16}]
{"$rows_left_out":38}
{"sheet":"Lookup Tables","index":7,"n_rows":64,"n_cols":13,"rows_kept":64,"cut":false,"hidden":false,"merged":[[0,1,0,2],[0,7,0,8],[46,1,46,3],[8,4,9,9],[13,7,13,12],[13,1,13,5],[0,4,0,5]]}
[null,"Activity Units",null,null,"Time Units",null,null,"SI Units"]
[null,"Unit","SI Factor",null,"Unit","SI Factor",null,"Type","SI Unit"]
[null,"Bq",1,null,"a",31556926,null,"Activity","Bq"]
[null,"dpm",{"$f":"1/60","v":1.6666666666666666E-2},null,"d",86400,null,"Mass","kg"]
[null,"kBq",1000,null,"h",3600,null,{"$f":"Type1","v":"Total"},"1"]
[null,"mBq",1E-3,null,"min",60,null,"Volume","m3"]
[null,"mCi",37000000,null,"s",1]
[null,"nCi",37]
[null,"pCi",3.6999999999999998E-2,null,"All unit conversion factors are based on SI units, although count times are more conveniently expressed in minutes, not seconds."]
[null,"μBq",9.9999999999999995E-7]
{"$rows_left_out":54}